{"text_format":"1","workbook":"xlsx","n_sheets":6,"sheets":["TOP","加入依頼書(一括払) ","加入依頼書(12回払) ","【入力例】加入依頼書","保険料表（隠す）","窓口名（隠す）"],"not_rendered":{"charts":0,"images":3,"macros":1,"external_links":0,"defined_names":4,"comments":2,"pivot_tables":0},"unopened":[],"bounds":{"document_bytes":16777216,"sheet_cells":100000,"rows_first":2000,"rows_last":500,"rows_between":2000,"halvings":0,"cell_chars":16384,"cell_head_chars":4096},"cells_cut":0,"cells_raw":0,"read":"whole","date_system":"1900"}

{"sheet":"TOP","index":0,"n_rows":26,"n_cols":8,"rows_kept":26,"cut":false,"hidden":false,"merged":[[22,0,22,1],[22,4,22,9],[25,0,25,1],[25,3,25,4],[21,2,21,9],[25,5,25,11],[23,2,23,11],[0,0,11,11],[15,1,20,4],[15,7,20,10],[12,2,12,9],[13,0,13,1]]}
["キープtheモータース保険\n新規加入依頼書作成ツール\n（2024年1月始期以降版）"]
[]
[]
[]
[]
[]
[]
[]
[]
[]
[]
[]
[]
["STEP1",null,null,"払込方法を選択（クリック）ください。"]
[]
[null,"一括払",null,null,null,null,null,"12回払"]
[]
[]
[]
[]
[]
[null,null,"※入力例はコチラをクリック"]
["STEP2",null,null,null,"部分をご入力ください。"]
[]
[]
["STEP3",null,null,"印刷",null,"クリック、所属の振興会へご提出ください。"]

{"sheet":"加入依頼書(一括払) ","index":1,"n_rows":50,"n_cols":33,"rows_kept":50,"cut":false,"hidden":false,"merged":[[34,1,34,30],[46,27,49,30],[45,27,45,30],[2,32,4,35],[43,26,43,30],[44,23,44,26],[44,27,44,30],[48,1,48,22],[48,23,49,26],[49,1,49,5],[49,6,49,9],[49,10,49,14],[49,15,49,20],[42,1,42,30],[43,1,43,3],[43,4,43,8],[43,9,43,11],[43,12,43,15],[43,16,43,18],[43,19,43,22],[43,23,43,25],[40,1,40,3],[40,4,40,30],[31,9,31,17],[37,30,38,30],[38,1,38,8],[38,9,38,26],[49,21,49,22],[36,1,36,8],[36,9,36,26],[36,27,36,30],[37,1,37,8],[37,9,37,26],[37,27,38,29],[26,1,26,3],[26,4,26,9],[26,11,26,14],[26,15,26,20],[26,21,26,23],[26,24,26,29],[32,9,32,17],[32,18,32,26],[33,1,33,8],[33,9,33,17],[33,18,33,26],[27,1,27,30],[30,1,30,8],[30,9,30,17],[30,18,30,26],[30,27,30,30],[31,1,31,8],[28,1,28,30],[31,18,31,26],[31,27,33,29],[32,1,32,8],[24,1,24,3],[24,12,24,14],[24,16,24,17],[24,24,24,27],[24,28,24,30],[25,1,25,3],[25,21,25,23],[25,24,25,30],[25,4,25,20],[16,1,16,3],[17,1,17,3],[18,1,18,3],[19,1,19,3],[16,4,16,26],[17,4,17,26],[18,4,18,11],[19,4,19,11],[23,1,23,3],[23,4,23,10],[23,11,23,14],[23,15,23,20],[23,21,23,23],[23,24,23,30],[21,1,21,30],[22,1,22,3],[22,4,22,10],[22,11,22,14],[22,15,22,20],[22,21,22,23],[22,24,22,30],[20,1,20,3],[20,4,20,26],[1,29,1,30],[3,1,4,30],[5,1,5,16],[6,1,7,30],[8,1,8,30],[9,1,9,30],[1,8,1,9],[1,11,1,12],[1,14,1,15],[1,18,1,20],[1,21,1,26],[1,27,1,28],[13,1,15,3],[13,4,13,5],[13,6,13,30],[14,4,15,30],[19,12,19,13],[19,14,19,26],[16,27,19,30],[12,22,12,24],[10,24,10,26],[10,1,11,3],[10,4,11,5],[10,6,11,9],[10,10,10,11],[10,12,10,14],[10,15,10,21],[12,1,12,3],[12,26,12,29],[12,5,12,6],[12,8,12,10],[12,11,12,14],[12,15,12,16],[12,18,12,20],[18,12,18,13],[18,14,18,26]]}
[]
[null,"加入依頼日",null,null,null,null,"令和",null,null,null,"年",null,null,"月",null,null,"日",null,"証券番号",null,null,{"$f":"IFERROR(VLOOKUP($I$25,'窓口名（隠す）'!F:I,3,0),\"\")","v":""},null,null,null,null,null,"枝番"]
[null,null,null,null,null,null,null,null,null,null,null,null,null,null,null,null,null,null,null,null,null,null,null,null,null,null,null,null,null,null,null,null,"戻る"]
[null,"日整連『キープtheモータース保険』新規加入依頼書"]
[]
[null,"一般社団法人　日本自動車整備振興会連合会",null,null,null,null,null,null,null,null,null,null,null,null,null,null,null,"御中"]
[null,"【重要】事実と異なる内容を記載した場合や事実を記載しなかった場合には、ご契約が解除されたり、保険金をお支払いできないことがありますのでご注意ください。"]
[]
[null,"※ご加入に際して申込人（加入者）は団体の構成員であることを確認し、重要事項等（パンフレット）の内容を確認・同意のうえ、加入依頼書の記載内容にしたがい、加入を依頼します。申込人（加入者）および被保険者は、募集文書または損保ジャパン公式ウェブサイト（https://www.sompo-japan.cp.jp/）に記載の個人情報の取扱いに同意します。"]
[null,"申込人（加入者）"]
[null,"窓口名",null,null,null,null,"顧客コード",null,null,null,"窓口",null,"支部",null,null,"事業所"]
[null,null,null,null,null,null,null,null,null,null,{"$f":"IFERROR(VLOOKUP(E11,'窓口名（隠す）'!B:D,2,0),\"\")","v":""},{"$f":"IFERROR(VLOOKUP(E11,'窓口名（隠す）'!B:D,3,0),\"\")","v":""},null,null,null,0,0,0]
[null,"郵便番号",null,null,"〒",null,null,"ー",null,null,null,"電話番号",null,null,null,null,null,"ー",null,null,null,"ー"]
[null,"住所",null,null,"ﾌﾘｶﾞﾅ"]
[]
[]
[null,"ﾌﾘｶﾞﾅ",null,null,null,null,null,null,null,null,null,null,null,null,null,null,null,null,null,null,null,null,null,null,null,null,null,"印"]
[null,"事業者名"]
[null,"ﾌﾘｶﾞﾅ",null,null,null,null,null,null,null,null,null,null,"ﾌﾘｶﾞﾅ"]
[null,"役職名",null,null,null,null,null,null,null,null,null,null,"代表者名"]
[null,"メールアドレス"]
[null,"加入内容（加入期間・保険料等）"]
[null,"契約プラン",null,null,"マルチリスクプラン",null,null,null,null,null,null,"契約方式",null,null,null,"企業包括方式",null,null,null,null,null,"補償プラン",null,null,"ワイドプラン"]
[null,"対象施設・業務の名称",null,null,"すべての施設・業務",null,null,null,null,null,null,"商品・製品等の保管場所",null,null,null,"すべての保管場所",null,null,null,null,null,"業種コード",null,null,"Q5"]
[null,"加入期間",null,null,"令和",null,6,"年",null,"月",1,"日","午前０時",null,null,"～","令和",null,{"$f":"G25+1","v":7},"年",{"$f":"I25","v":0},"月",1,"日","午後4時まで",null,null,null,"1 年間"]
[null,"売上高\n区分※",null,null,null,null,null,null,null,null,null,null,null,null,null,null,null,null,null,null,null,"払込方法",null,null,"一括払（収納代行）"]
[null,"保険料",null,null,{"$f":"IFERROR(VLOOKUP($E$26,'保険料表（隠す）'!B:F,3,0),\"\")","v":""},null,null,null,null,null,"円","制度維持費\n(内税)",null,null,null,"200円／１振替",null,null,null,null,null,"掛金",null,null,{"$f":"IFERROR(($E$27+200),\"\")","v":""},null,null,null,null,null,"円"]
[null,"（注）売上高区分は正しくご申告ください。事実と異なることを告げた場合には、ご契約が解除されたり、保険金をお支払できないことがあります。"]
[null,"補償内容"]
[null,"物損害担保条項"]
[null,"保険金の種類",null,null,null,null,null,null,null,"支払限度額（1事故あたり）",null,null,null,null,null,null,null,null,"免責金額（１事故あたり）",null,null,null,null,null,null,null,null,"保険料"]
[null,"損害保険金",null,null,null,null,null,null,null,"10,000千円",null,null,null,null,null,null,null,null,"10千円（△）",null,null,null,null,null,null,null,null,{"$f":"IFERROR(VLOOKUP($E$26,'保険料表（隠す）'!B:I,4,0),\"\")","v":""}]
[null,"通貨等盗難損害保険金",null,null,null,null,null,null,null,"1,000千円",null,null,null,null,null,null,null,null,"ー",null,null,null,null,null,null,null,null,null,null,null,"円"]
[null,"物損害事故付随費用保険金",null,null,null,null,null,null,null,"10,000千円",null,null,null,null,null,null,null,null,"ー"]
[null,"(△)事故の種類により自己負担額の適用有無が異なります。詳細については、パンフレット等をご確認ください。"]
[null,"休業損失担保条項"]
[null,"保険金の種類",null,null,null,null,null,null,null,"支払限度額（1事故あたり）",null,null,null,null,null,null,null,null,null,null,null,null,null,null,null,null,null,"保険料"]
[null,"休業損失保険金",null,null,null,null,null,null,null,"10,000千円",null,null,null,null,null,null,null,null,null,null,null,null,null,null,null,null,null,{"$f":"IFERROR(VLOOKUP($E$26,'保険料表（隠す）'!B:I,5,0),\"\")","v":""},null,null,"円"]
[null,"営業継続費用保険金",null,null,null,null,null,null,null,"5,000千円"]
[]
[null,"付帯される特約",null,null,"事業活動総合保険追加特約(C1)・賠償ユニット不担保特約(C7)・傷害ユニット不担保特約(C8)"]
[]
[null,"他の保険契約等"]
[null,"会社名",null,null,null,null,null,null,null,"保険種類",null,null,null,null,null,null,"満期日",null,null,null,null,null,null,"保険金額"]
[]
[null,"一般社団法人日本自動車整備振興会連合会（適格請求書発行事業者登録番号：T3010405001011）",null,null,null,null,null,null,null,null,null,null,null,null,null,null,null,null,null,null,null,null,null,null,null,null,null,"全共済受付印"]
[null,"制度維持費／毎回200円（適用税率 10% 内消費税額等18円）"]
[]
[null,"保険会社使用欄"]
[null,"取扱代理店",null,null,null,null,"全共済",null,null,null,"J55H8‐015",null,null,null,null,"営業開発部第三課",null,null,null,null,null,3765]

{"sheet":"加入依頼書(12回払) ","index":2,"n_rows":51,"n_cols":33,"rows_kept":51,"cut":false,"hidden":false,"merged":[[21,4,21,26],[50,21,50,22],[44,26,44,30],[45,23,45,26],[45,27,45,30],[49,1,49,22],[49,23,50,26],[50,1,50,5],[50,6,50,9],[50,10,50,14],[50,15,50,20],[47,27,50,30],[46,27,46,30],[43,1,43,30],[44,1,44,3],[44,4,44,8],[44,9,44,11],[44,12,44,15],[44,16,44,18],[44,19,44,22],[44,23,44,25],[41,1,41,3],[41,4,41,30],[35,1,35,30],[37,1,37,8],[37,9,37,26],[37,27,37,30],[38,1,38,8],[38,9,38,26],[38,27,39,29],[38,30,39,30],[39,1,39,8],[39,9,39,26],[32,1,32,8],[32,9,32,17],[32,18,32,26],[32,27,34,29],[33,1,33,8],[33,9,33,17],[33,18,33,26],[34,1,34,8],[34,9,34,17],[34,18,34,26],[28,1,28,30],[29,1,29,30],[31,1,31,8],[31,9,31,17],[31,18,31,26],[31,27,31,30],[27,1,27,3],[27,4,27,9],[27,11,27,14],[27,15,27,20],[27,21,27,23],[27,24,27,29],[25,1,25,3],[25,12,25,14],[25,16,25,17],[25,24,25,27],[25,28,25,30],[26,1,26,3],[26,21,26,23],[26,24,26,30],[26,4,26,20],[24,1,24,3],[24,4,24,10],[24,11,24,14],[24,15,24,20],[24,21,24,23],[24,24,24,30],[22,1,22,30],[23,1,23,3],[23,4,23,10],[23,11,23,14],[23,15,23,20],[23,21,23,23],[23,24,23,30],[21,1,21,3],[2,32,4,35],[3,1,4,30],[5,1,5,16],[6,1,8,30],[9,1,9,30],[13,1,13,3],[1,8,1,9],[1,11,1,12],[1,14,1,15],[1,18,1,20],[1,21,1,26],[1,27,1,28],[10,1,10,30],[11,1,12,3],[11,4,12,5],[11,6,12,9],[11,10,11,11],[11,12,11,14],[11,15,11,21],[11,24,11,26],[1,29,1,30],[13,5,13,6],[13,8,13,10],[13,11,13,14],[13,15,13,16],[13,18,13,20],[13,22,13,24],[19,1,19,3],[19,4,19,11],[19,12,19,13],[19,14,19,26],[20,1,20,3],[20,4,20,11],[20,12,20,13],[20,14,20,26],[14,1,16,3],[14,4,14,5],[14,6,14,30],[15,4,16,30],[17,1,17,3],[17,4,17,26],[17,27,20,30],[18,1,18,3],[18,4,18,26]]}
[]
[null,"加入依頼日",null,null,null,null,"令和",null,null,null,"年",null,null,"月",null,null,"日",null,"証券番号",null,null,{"$f":"IFERROR(VLOOKUP($I$26,'窓口名（隠す）'!F:I,4,0),\"\")","v":""},null,null,null,null,null,"枝番"]
[null,null,null,null,null,null,null,null,null,null,null,null,null,null,null,null,null,null,null,null,null,null,null,null,null,null,null,null,null,null,null,null,"戻る"]
[null,"日整連『キープtheモータース保険』新規加入依頼書"]
[]
[null,"一般社団法人　日本自動車整備振興会連合会",null,null,null,null,null,null,null,null,null,null,null,null,null,null,null,"御中"]
[null,"【重要】事実と異なる内容を記載した場合や事実を記載しなかった場合には、ご契約が解除されたり、保険金をお支払いできないことがありますのでご注意ください。"]
[]
[]
[null,"※ご加入に際して申込人（加入者）は団体の構成員であることを確認し、重要事項等（パンフレット）の内容を確認・同意のうえ、加入依頼書の記載内容にしたがい、加入を依頼します。申込人（加入者）および被保険者は、募集文書または損保ジャパン公式ウェブサイト（https://www.sompo-japan.cp.jp/）に記載の個人情報の取扱いに同意します。"]
[null,"申込人（加入者）"]
[null,"窓口名",null,null,null,null,"顧客コード",null,null,null,"窓口",null,"支部",null,null,"事業所"]
[null,null,null,null,null,null,null,null,null,null,{"$f":"IFERROR(VLOOKUP(E12,'窓口名（隠す）'!B:D,2,0),\"\")","v":""},{"$f":"IFERROR(VLOOKUP(E12,'窓口名（隠す）'!B:D,3,0),\"\")","v":""},null,null,null,0,0,0]
[null,"郵便番号",null,null,"〒",null,null,"ー",null,null,null,"電話番号",null,null,null,null,null,"ー",null,null,null,"ー"]
[null,"住所",null,null,"ﾌﾘｶﾞﾅ"]
[]
[]
[null,"ﾌﾘｶﾞﾅ",null,null,null,null,null,null,null,null,null,null,null,null,null,null,null,null,null,null,null,null,null,null,null,null,null,"印"]
[null,"事業者名"]
[null,"ﾌﾘｶﾞﾅ",null,null,null,null,null,null,null,null,null,null,"ﾌﾘｶﾞﾅ"]
[null,"役職名",null,null,null,null,null,null,null,null,null,null,"代表者名"]
[null,"メールアドレス"]
[null,"加入内容（加入期間・保険料等）"]
[null,"契約プラン",null,null,"マルチリスクプラン",null,null,null,null,null,null,"契約方式",null,null,null,"企業包括方式",null,null,null,null,null,"補償プラン",null,null,"ワイドプラン"]
[null,"対象施設・業務の名称",null,null,"すべての施設・業務",null,null,null,null,null,null,"商品・製品等の保管場所",null,null,null,"すべての保管場所",null,null,null,null,null,"業種コード",null,null,"Q5"]
[null,"加入期間",null,null,"令和",null,6,"年",null,"月",1,"日","午前０時",null,null,"～","令和",null,{"$f":"G26+1","v":7},"年",{"$f":"I26","v":0},"月",1,"日","午後4時まで",null,null,null,"1 年間"]
[null,"売上高\n区分※",null,null,null,null,null,null,null,null,null,null,null,null,null,null,null,null,null,null,null,"払込方法",null,null,"12回払（収納代行）"]
[null,"保険料",null,null,{"$f":"IFERROR(VLOOKUP($E$27,'保険料表（隠す）'!B:I,6,0),\"\")","v":""},null,null,null,null,null,"円","制度維持費\n(内税)",null,null,null,"200円／１振替",null,null,null,null,null,"掛金",null,null,{"$f":"IFERROR(E28+200,\"\")","v":""},null,null,null,null,null,"円"]
[null,"（注）売上高区分は正しくご申告ください。事実と異なることを告げた場合には、ご契約が解除されたり、保険金をお支払できないことがあります。"]
[null,"補償内容"]
[null,"物損害担保条項"]
[null,"保険金の種類",null,null,null,null,null,null,null,"支払限度額（1事故あたり）",null,null,null,null,null,null,null,null,"免責金額（１事故あたり）",null,null,null,null,null,null,null,null,"保険料"]
[null,"損害保険金",null,null,null,null,null,null,null,"10,000千円",null,null,null,null,null,null,null,null,"10千円（△）",null,null,null,null,null,null,null,null,{"$f":"IFERROR(VLOOKUP($E$27,'保険料表（隠す）'!B:I,7,0),\"\")","v":""}]
[null,"通貨等盗難損害保険金",null,null,null,null,null,null,null,"1,000千円",null,null,null,null,null,null,null,null,"ー",null,null,null,null,null,null,null,null,null,null,null,"円"]
[null,"物損害事故付随費用保険金",null,null,null,null,null,null,null,"10,000千円",null,null,null,null,null,null,null,null,"ー"]
[null,"(△)事故の種類により自己負担額の適用有無が異なります。詳細については、パンフレット等をご確認ください。"]
[null,"休業損失担保条項"]
[null,"保険金の種類",null,null,null,null,null,null,null,"支払限度額（1事故あたり）",null,null,null,null,null,null,null,null,null,null,null,null,null,null,null,null,null,"保険料"]
[null,"休業損失保険金",null,null,null,null,null,null,null,"10,000千円",null,null,null,null,null,null,null,null,null,null,null,null,null,null,null,null,null,{"$f":"IFERROR(VLOOKUP($E$27,'保険料表（隠す）'!B:I,8,0),\"\")","v":""},null,null,"円"]
[null,"営業継続費用保険金",null,null,null,null,null,null,null,"5,000千円"]
[]
[null,"付帯される特約",null,null,"事業活動総合保険追加特約(C1)・賠償ユニット不担保特約(C7)・傷害ユニット不担保特約(C8)"]
[]
[null,"他の保険契約等"]
[null,"会社名",null,null,null,null,null,null,null,"保険種類",null,null,null,null,null,null,"満期日",null,null,null,null,null,null,"保険金額"]
[]
[null,"一般社団法人日本自動車整備振興会連合会（適格請求書発行事業者登録番号：T3010405001011）",null,null,null,null,null,null,null,null,null,null,null,null,null,null,null,null,null,null,null,null,null,null,null,null,null,"全共済受付印"]
[null,"制度維持費／毎回200円（適用税率 10% 内消費税額等18円）"]
[]
[null,"保険会社使用欄"]
[null,"取扱代理店",null,null,null,null,"全共済",null,null,null,"J55H8‐015",null,null,null,null,"営業開発部第三課",null,null,null,null,null,3765]

{"sheet":"【入力例】加入依頼書","index":3,"n_rows":51,"n_cols":33,"rows_kept":51,"cut":false,"hidden":false,"merged":[[1,29,1,30],[2,32,4,35],[3,1,4,30],[5,1,5,16],[6,1,8,30],[9,1,9,30],[1,8,1,9],[1,11,1,12],[1,14,1,15],[1,18,1,20],[1,21,1,26],[1,27,1,28],[13,1,13,3],[10,1,10,30],[11,1,12,3],[11,4,12,5],[11,6,12,9],[11,10,11,11],[11,12,11,14],[11,15,11,21],[11,24,11,26],[13,26,13,29],[13,5,13,6],[13,8,13,10],[13,11,13,14],[13,15,13,16],[13,18,13,20],[13,22,13,24],[19,1,19,3],[19,4,19,11],[19,12,19,13],[19,14,19,26],[20,1,20,3],[20,4,20,11],[20,12,20,13],[20,14,20,26],[14,1,16,3],[14,4,14,5],[14,6,14,30],[15,4,16,30],[17,1,17,3],[17,4,17,26],[17,27,20,30],[18,1,18,3],[18,4,18,26],[21,1,21,3],[21,4,21,26],[25,1,25,3],[25,12,25,14],[25,16,25,17],[25,24,25,27],[25,28,25,30],[26,1,26,3],[26,21,26,23],[26,24,26,30],[26,4,26,20],[24,1,24,3],[24,4,24,10],[24,11,24,14],[24,15,24,20],[24,21,24,23],[24,24,24,30],[22,1,22,30],[23,1,23,3],[23,4,23,10],[23,11,23,14],[23,15,23,20],[23,21,23,23],[23,24,23,30],[28,1,28,30],[29,1,29,30],[31,1,31,8],[31,9,31,17],[31,18,31,26],[31,27,31,30],[27,1,27,3],[27,4,27,9],[27,11,27,14],[27,15,27,20],[27,21,27,23],[27,24,27,29],[32,1,32,8],[32,9,32,17],[32,18,32,26],[32,27,34,29],[33,1,33,8],[33,9,33,17],[33,18,33,26],[34,1,34,8],[34,9,34,17],[34,18,34,26],[43,1,43,30],[44,1,44,3],[44,4,44,8],[44,9,44,11],[44,12,44,15],[44,16,44,18],[44,19,44,22],[44,23,44,25],[35,1,35,30],[37,1,37,8],[37,9,37,26],[37,27,37,30],[38,1,38,8],[38,9,38,26],[38,27,39,29],[38,30,39,30],[39,1,39,8],[39,9,39,26],[41,1,41,3],[41,4,41,30],[50,21,50,22],[44,26,44,30],[45,23,45,26],[45,27,45,30],[49,1,49,22],[49,23,50,26],[50,1,50,5],[50,6,50,9],[50,10,50,14],[50,15,50,20],[47,27,50,30],[46,27,46,30]]}
[]
[null,"加入依頼日",null,null,null,null,"令和",null,5,null,"年",11,null,"月",1,null,"日",null,"証券番号",null,null,9802956160,null,null,null,null,null,"枝番"]
[null,null,null,null,null,null,null,null,null,null,null,null,null,null,null,null,null,null,null,null,null,null,null,null,null,null,null,null,null,null,null,null,"戻る"]
[null,"日整連『キープtheモータース保険』新規加入依頼書"]
[]
[null,"一般社団法人　日本自動車整備振興会連合会",null,null,null,null,null,null,null,null,null,null,null,null,null,null,null,"御中"]
[null,"【重要】事実と異なる内容を記載した場合や事実を記載しなかった場合には、ご契約が解除されたり、保険金をお支払いできないことがありますのでご注意ください。"]
[]
[]
[null,"※ご加入に際して申込人（加入者）は団体の構成員であることを確認し、重要事項等（パンフレット）の内容を確認・同意のうえ、加入依頼書の記載内容にしたがい、加入を依頼します。申込人（加入者）および被保険者は、募集文書または損保ジャパン公式ウェブサイト（https://www.sompo-japan.cp.jp/）に記載の個人情報の取扱いに同意します。"]
[null,"申込人（加入者）"]
[null,"窓口名",null,null,"東京",null,"顧客コード",null,null,null,"窓口",null,"支部",null,null,"事業所"]
[null,null,null,null,null,null,null,null,null,null,{"$f":"VLOOKUP(E12,'窓口名（隠す）'!B:D,2,0)","v":"１"},{"$f":"VLOOKUP(E12,'窓口名（隠す）'!B:D,3,0)","v":8},null,null,null,0,0,0]
[null,"郵便番号",null,null,"〒",160,null,"ー",8338,null,null,"電話番号",null,null,null,"03",null,"ー","1234",null,null,"ー","5678"]
[null,"住所",null,null,"ﾌﾘｶﾞﾅ",null,"ﾄｳｷｮｳﾄ ｼﾝｼﾞｭｸｸ ﾆｼｼﾝｼﾞｭｸ 1-26-1"]
[null,null,null,null,"東京都新宿区西新宿１－２６－１"]
[]
[null,"ﾌﾘｶﾞﾅ",null,null,"ｿﾝﾎﾟﾓｰﾀｰｽ ｶﾌﾞｼｷｶﾞｲｼｬ",null,null,null,null,null,null,null,null,null,null,null,null,null,null,null,null,null,null,null,null,null,null,"印"]
[null,"事業者名",null,null,"損保モータース　株式会社"]
[null,"ﾌﾘｶﾞﾅ",null,null,"ﾀﾞｲﾋｮｳﾄﾘｼﾏﾘﾔｸ",null,null,null,null,null,null,null,"ﾌﾘｶﾞﾅ",null,"ｿﾝﾎﾟ ﾀﾛｳ"]
[null,"役職名",null,null,"代表取締役",null,null,null,null,null,null,null,"代表者名",null,"損保　太郎"]
[null,"メールアドレス",null,null,"sompo@xxxxx.co.jp"]
[null,"加入内容（加入期間・保険料等）"]
[null,"契約プラン",null,null,"マルチリスクプラン",null,null,null,null,null,null,"契約方式",null,null,null,"企業包括方式",null,null,null,null,null,"補償プラン",null,null,"ワイドプラン"]
[null,"対象施設・業務の名称",null,null,"すべての施設・業務",null,null,null,null,null,null,"商品・製品等の保管場所",null,null,null,"すべての保管場所",null,null,null,null,null,"業種コード",null,null,"Q5"]
[null,"加入期間",null,null,"令和",null,6,"年",1,"月",1,"日","午前０時",null,null,"～","令和",null,{"$f":"G26+1","v":7},"年",{"$f":"I26","v":1},"月",1,"日","午後4時まで",null,null,null,"1 年間"]
[null,"売上高\n区分※",null,null,"G　(6,000万円超～7,000万円以下)",null,null,null,null,null,null,null,null,null,null,null,null,null,null,null,null,"払込方法",null,null,"一括払（収納代行）"]
[null,"保険料",null,null,{"$f":"VLOOKUP(E27,'保険料表（隠す）'!B:I,3,0)","v":135850},null,null,null,null,null,"円","制度維持費\n(内税)",null,null,null,"200円／１振替",null,null,null,null,null,"掛金",null,null,{"$f":"E28+200","v":136050},null,null,null,null,null,"円"]
[null,"（注）売上高区分は正しくご申告ください。事実と異なることを告げた場合には、ご契約が解除されたり、保険金をお支払できないことがあります。"]
[null,"補償内容"]
[null,"物損害担保条項"]
[null,"保険金の種類",null,null,null,null,null,null,null,"支払限度額（1事故あたり）",null,null,null,null,null,null,null,null,"免責金額（１事故あたり）",null,null,null,null,null,null,null,null,"保険料"]
[null,"損害保険金",null,null,null,null,null,null,null,"10,000千円",null,null,null,null,null,null,null,null,"10千円（△）",null,null,null,null,null,null,null,null,{"$f":"VLOOKUP(E27,'保険料表（隠す）'!B:I,4,0)","v":64470}]
[null,"通貨等盗難損害保険金",null,null,null,null,null,null,null,"1,000千円",null,null,null,null,null,null,null,null,"ー",null,null,null,null,null,null,null,null,null,null,null,"円"]
[null,"物損害事故付随費用保険金",null,null,null,null,null,null,null,"10,000千円",null,null,null,null,null,null,null,null,"ー"]
[null,"(△)事故の種類により自己負担額の適用有無が異なります。詳細については、パンフレット等をご確認ください。"]
[null,"休業損失担保条項"]
[null,"保険金の種類",null,null,null,null,null,null,null,"支払限度額（1事故あたり）",null,null,null,null,null,null,null,null,null,null,null,null,null,null,null,null,null,"保険料"]
[null,"休業損失保険金",null,null,null,null,null,null,null,"10,000千円",null,null,null,null,null,null,null,null,null,null,null,null,null,null,null,null,null,{"$f":"VLOOKUP(E27,'保険料表（隠す）'!B:I,5,0)","v":71380},null,null,"円"]
[null,"営業継続費用保険金",null,null,null,null,null,null,null,"5,000千円"]
[]
[null,"付帯される特約",null,null,"事業活動総合保険追加特約(C1)・賠償ユニット不担保特約(C7)・傷害ユニット不担保特約(C8)"]
[]
[null,"他の保険契約等"]
[null,"会社名",null,null,null,null,null,null,null,"保険種類",null,null,null,null,null,null,"満期日",null,null,null,null,null,null,"保険金額"]
[]
[null,"一般社団法人日本自動車整備振興会連合会（適格請求書発行事業者登録番号：T3010405001011）",null,null,null,null,null,null,null,null,null,null,null,null,null,null,null,null,null,null,null,null,null,null,null,null,null,"全共済受付印"]
[null,"制度維持費／毎回200円（適用税率 10% 内消費税額等18円）"]
[]
[null,"保険会社使用欄"]
[null,"取扱代理店",null,null,null,null,"全共済",null,null,null,"J55H8‐015",null,null,null,null,"営業開発部第三課",null,null,null,null,null,3765]

{"sheet":"保険料表（隠す）","index":4,"n_rows":31,"n_cols":9,"rows_kept":31,"cut":false,"hidden":true,"merged":[[2,8,3,8],[2,4,3,4],[2,5,3,5],[2,2,3,2],[2,1,3,1],[2,3,3,3],[2,6,3,6],[2,7,3,7]]}
[null,"キープtheモータース保険　保険料表"]
[]
[null,"クラス","売上高\n（百万円）","合計保険料","物損害ユニット","休業ユニット","合計保険料","物損害ユニット","休業ユニット"]
[]
[null,null,null,null,"一括払",null,null,"分割払"]
[null,"A　(1,000万円以下）","1,000",46460,9920,36540,3880,830,3050]
[null,"B　(1,000万円超～2,000万円以下)","1,001-2,000",54700,14880,39820,4560,1240,3320]
[null,"C　(2,000万円超～3,000万円以下)","2,001-3,000",71170,24800,46370,5940,2070,3870]
[null,"D　(3,000万円超～4,000万円以下)","3,001-4,000",87660,34720,52940,7300,2890,4410]
[null,"E　(4,000万円超～5,000万円以下)","4,001-5,000",104140,44640,59500,8680,3720,4960]
[null,"F　(5,000万円超～6,000万円以下)","5,001-6,000",120200,54550,65650,10020,4550,5470]
[null,"G　(6,000万円超～7,000万円以下)","6,001-7,000",135850,64470,71380,11310,5370,5940]
[null,"H　(7,000万円超～8,000万円以下)","7,001-8,000",151500,74390,77110,12630,6200,6430]
[null,"I　 (8,000万円超～9,000万円以下)","8,001-9,000",167150,84310,82840,13930,7030,6900]
[null,"J　 (9,000万円超～10,000万円以下)","9,001-10,000",182810,94230,88580,15230,7850,7380]
[null,"K　(10,000万円超～11,000万円以下)","10,001-11,000",198460,104150,94310,16540,8680,7860]
[null,"L　(11,000万円超～12,000万円以下)","11,001-12,000",214110,114070,100040,17850,9510,8340]
[null,"M  (12,000万円超～13,000万円以下)","12,001-13,000",229760,123990,105770,19140,10330,8810]
[null,"N  (13,000万円超～14,000万円以下)","13,001-14,000",245410,133910,111500,20450,11160,9290]
[null,"O  (14,000万円超～15,000万円以下)","14,001-15,000",261070,143830,117240,21760,11990,9770]
[null,"P　(15,000万円超～16,000万円以下)","15,001-16,000",276710,153740,122970,23050,12810,10240]
[null,"Q　(16,000万円超～17,000万円以下)","16,001-17,000",292360,163660,128700,24370,13640,10730]
[null,"R　(17,000万円超～18,000万円以下)","17,001-18,000",308020,173580,134440,25670,14470,11200]
[null,"S　(18,000万円超～19,000万円以下)","18,001-19,000",323670,183500,140170,26980,15290,11690]
[null,"T　(19,000万円超～20,000万円以下)","19,001-20,000",339330,193420,145910,28280,16120,12160]
[null,"U  (20,000万円超～21,000万円以下)","20,001-21,000",353550,202590,150960,29460,16880,12580]
[null,"V　(21,000万円超～22,000万円以下)","21,001-22,000",366330,211000,155330,30530,17580,12950]
[null,"W (22,000万円超～23,000万円以下)","22,001-23,000",379120,219420,159700,31590,18280,13310]
[null,"X　(23,000万円超～24,000万円以下)","23,001-24,000",391910,227830,164080,32660,18990,13670]
[null,"Y　(24,000万円超～25,000万円以下)","24,001-25,000",404700,236240,168460,33720,19690,14030]
[null,"Z　(25,000万円超～26,000万円以下)","25,001-26,000",417490,244660,172830,34790,20390,14400]

{"sheet":"窓口名（隠す）","index":5,"n_rows":56,"n_cols":9,"rows_kept":56,"cut":false,"hidden":true,"merged":[[1,2,1,3]]}
[]
[null,"窓口名","コード番号",null,null,null,"月","証券番号（一括払）","証券番号（１２回払）"]
[null,"札幌","０",2,null,1,"01","9802956160",9802956160]
[null,"函館","０",3,null,2,"02",9802956161,9802956161]
[null,"室蘭","０",4,null,3,"03",9802956162,9802956162]
[null,"帯広","０",5,null,4,"04",9802956163,9802956163]
[null,"釧路","０",6,null,5,"05",9802956164,9802956164]
[null,"北見","０",7,null,6,"06",9802956165,9802956165]
[null,"旭川","０",8,null,7,"07",9802956166,9802956166]
[null,"宮城","０",9,null,8,"08",9802956167,9802956167]
[null,"福島","１",0,null,9,"09",9802956168,9802956168]
[null,"岩手","１",1,null,10,10,9802956169,9802956169]
[null,"青森","１",2,null,11,11,9802956170,9802956170]
[null,"新潟","１",3,null,12,12,9802956171,9802956171]
[null,"長野","１",4]
[null,"山形","１",5]
[null,"秋田","１",6]
[null,"東京","１",8]
[null,"神奈川","２",0]
[null,"埼玉","２",1]
[null,"群馬","２",2]
[null,"千葉","２",3]
[null,"茨城","２",4]
[null,"栃木","２",6]
[null,"山梨","２",7]
[null,"愛知","２",8]
[null,"静岡","３",0]
[null,"岐阜","３",2]
[null,"三重","３",4]
[null,"福井","３",5]
[null,"石川","３",6]
[null,"富山","３",8]
[null,"大阪","３",9]
[null,"京都","４",1]
[null,"兵庫","４",4]
[null,"奈良","４",5]
[null,"滋賀","４",7]
[null,"和歌山","４",8]
[null,"広島","５",0]
[null,"鳥取","５",1]
[null,"島根","５",2]
[null,"岡山","５",4]
[null,"山口","５",5]
[null,"香川","５",8]
[null,"徳島","５",9]
[null,"愛媛","６",0]
[null,"高知","６",1]
[null,"福岡","６",2]
[null,"長崎","６",4]
[null,"大分","６",5]
[null,"佐賀","６",6]
[null,"熊本","６",8]
[null,"宮﨑","６",9]
[null,"鹿児島","7",0]
[null,"沖縄","7",2]
[null,"日車協","8",8]