{"text_format":"1","workbook":"xlsx","n_sheets":6,"sheets":["TOP","解約 (一括払)","解約（12回払）","その他","保険料表（隠す）","返戻保険料計算"],"not_rendered":{"charts":0,"images":3,"macros":1,"external_links":0,"defined_names":3,"comments":0,"pivot_tables":0},"unopened":[],"bounds":{"document_bytes":16777216,"sheet_cells":100000,"rows_first":2000,"rows_last":500,"rows_between":2000,"halvings":0,"cell_chars":16384,"cell_head_chars":4096},"cells_cut":0,"cells_raw":0,"read":"whole","date_system":"1900"}

{"sheet":"TOP","index":0,"n_rows":28,"n_cols":7,"rows_kept":28,"cut":false,"hidden":false,"merged":[[16,2,17,9],[0,1,9,8],[22,0,22,1],[22,4,22,9],[27,0,27,1],[27,3,27,9],[13,0,13,1],[13,2,13,9],[15,4,15,5],[14,2,14,5],[15,2,15,3],[11,0,11,9],[14,6,15,9],[24,2,25,9],[18,2,20,9]]}
[null,"キープtheモータース保険\n解約依頼書・加入内容変更依頼書\n作成ツール"]
[]
[]
[]
[]
[]
[]
[]
[]
[]
[]
["お手元に加入依頼書(控）もしくは加入証をご用意のうえ、ご入力ください。"]
[]
["STEP1",null,"解約・加入内容変更をご選択ください。"]
[null,null,"解約",null,null,null,"加入内容変更（※１）"]
[null,null,"一括払",null,"12回払"]
[null,null,"（※１）加入内容変更とは、以下の事由をいいます。\n　　　加入者情報変更（※２）／口座情報変更／加入証再発行"]
[]
[null,null,"（※２）個人事業主が法人化した場合、加入者名の変更では手続きができません。\n　　　　個人事業主としての契約を解約し、同日付で法人として新規契約の手続き\n　　　　が必要です。（法人を解散し、個人事業主となる場合も同様です。）"]
[]
[]
[]
["STEP2",null,null,null,"セルをご入力ください。"]
[]
[null,null,"※「加入内容変更」の場合は、　　　　　セルで該当の変更事由に〇を選択ください。\n　なお、変更事由が「加入者情報変更」の場合は、変更前と変更後の加入者情報（変更\n　箇所のみ）をご入力ください。"]
[]
[]
["STEP３",null,null,"印刷ボタンより印刷し、所属の振興会・商工組合・協同組合へ提出ください。"]

{"sheet":"解約 (一括払)","index":1,"n_rows":44,"n_cols":35,"rows_kept":44,"cut":false,"hidden":false,"merged":[[26,1,26,30],[27,1,27,16],[27,17,27,30],[28,1,29,15],[2,15,2,18],[3,15,4,18],[6,2,6,29],[29,24,29,29],[24,1,25,15],[24,16,25,16],[24,17,24,23],[24,24,24,30],[25,17,25,22],[25,24,25,29],[18,1,21,3],[18,4,21,13],[42,23,42,26],[14,11,15,12],[38,23,38,30],[39,23,39,24],[39,25,39,26],[39,28,39,29],[41,23,41,26],[14,13,15,14],[36,23,36,30],[33,11,33,16],[37,25,37,26],[37,28,37,29],[28,16,29,16],[28,17,28,23],[28,24,28,30],[29,17,29,22],[7,34,9,39],[44,1,44,16],[44,19,44,20],[44,21,44,22],[42,1,42,7],[42,8,42,16],[42,19,42,20],[42,21,42,22],[43,1,43,16],[38,1,40,10],[38,11,40,16],[41,1,41,7],[41,8,41,16],[41,27,41,30],[32,1,32,16],[33,1,33,10],[34,1,36,10],[34,11,36,16],[37,1,37,10],[37,11,37,16],[37,23,37,24],[18,17,21,19],[18,20,21,30],[23,1,23,16],[23,17,23,30],[16,1,16,7],[16,8,16,11],[16,12,16,14],[16,17,16,19],[16,21,16,30],[14,1,15,3],[14,17,15,19],[10,1,10,30],[12,1,12,3],[12,4,12,26],[12,27,12,30],[14,20,14,21],[14,24,14,25],[15,20,15,21],[15,24,15,25],[14,4,15,5],[14,6,15,6],[14,7,15,7],[14,8,15,9],[14,10,15,10],[1,5,1,6],[1,8,1,9],[1,11,1,12],[1,15,1,18],[1,19,1,25],[8,16,8,18],[1,26,1,27],[1,28,1,30],[3,19,3,20],[3,21,3,23],[3,24,3,30],[2,19,2,30]]}
[]
[null,"請求日：令和",null,null,null,null,null,"年",null,null,"月",null,null,"日",null,"証券番号",null,null,null,{"$f":"IFERROR(VLOOKUP(Y15,'保険料表（隠す）'!A34:B45,2,0),\"\")","v":""},null,null,null,null,null,null,"枝番"]
[null,null,null,null,null,null,null,null,null,null,null,null,null,null,null,"窓口名",null,null,null,"顧客コード"]
[null,null,null,null,null,null,null,null,null,null,null,null,null,null,null,null,null,null,null,"窓口",null,"支部",null,null,"事業所"]
[null,null,null,null,null,null,null,null,null,null,null,null,null,null,null,null,null,null,null,{"$f":"IFERROR(VLOOKUP(P4,'保険料表（隠す）'!D33:F87,2,0),\"\")","v":""},{"$f":"IFERROR(VLOOKUP(P4,'保険料表（隠す）'!D33:F87,3,0),\"\")","v":""},null,null,null,0,0,0]
[]
[null,null,"日整連『キープtheモータース保険』解約依頼書"]
[null,null,null,null,null,null,null,null,null,null,null,null,null,null,null,null,null,null,null,null,null,null,null,null,null,null,null,null,null,null,null,null,null,null,"戻る"]
[null,"一般社団法人　日本自動車整備振興会連合会",null,null,null,null,null,null,null,null,null,null,null,null,null,null,"御中"]
[]
[null,"【重要】\n　下記のとおり、一般社団法人　日本自動車整備振興会連合会　「キープtheモータース保険」への解約を依頼します。\n　申込人（加入者）および被保険者は募集文書に掲載の個人情報の取扱いに同意します。"]
[null,"　"]
[null,"事業者名",null,null,null,null,null,null,null,null,null,null,null,null,null,null,null,null,null,null,null,null,null,null,null,null,null,"印"]
[]
[null,"解約日",null,null,"令和",null,null,"年",null,null,"月",1,null,"日",null,null,null,"契約\n保険期間",null,null,"令和",null,4,"年",null,null,"月",1,"日","から"]
[null,null,null,null,null,null,null,null,null,null,null,null,null,null,null,null,null,null,null,null,"令和",null,{"$f":"W15+1","v":5},"年",{"$f":"$Y$15","v":0},null,"月",1,"日","まで"]
[null,"未経過保険期間",null,null,null,null,null,null,{"$f":"返戻保険料計算!J2","v":""},null,null,null,"か月"]
[null,null,null,null,null,null,null,null,null,null,null,null,null,null,null,null,null,"※契約時の売上高区分を選択ください。"]
[null,"契約時\n払込方法",null,null,"一括払",null,null,null,null,null,null,null,null,null,null,null,null,"契約時\n売上高\n区分"]
[]
[]
[]
[]
[null,"解約保険料",null,null,null,null,null,null,null,null,null,null,null,null,null,null,null,"内訳保険料"]
[null,{"$f":"IFERROR(R26+Y26,\"\")","v":""},null,null,null,null,null,null,null,null,null,null,null,null,null,null,"円","物損害担保条項",null,null,null,null,null,null,"休業損失担保条項"]
[null,null,null,null,null,null,null,null,null,null,null,null,null,null,null,null,null,{"$f":"返戻保険料計算!C10","v":""},null,null,null,null,null,"円",{"$f":"返戻保険料計算!C11","v":""},null,null,null,null,null,"円"]
[null,"解約日の翌月末日に、ご登録の口座へ解約保険料を損保ジャパンよりお振込みいたします。"]
[null,"原契約保険料",null,null,null,null,null,null,null,null,null,null,null,null,null,null,null,"内訳保険料"]
[null,{"$f":"IFERROR(VLOOKUP($U$19,'保険料表（隠す）'!B:J,3,0),\"\")","v":""},null,null,null,null,null,null,null,null,null,null,null,null,null,null,"円","物損害担保条項",null,null,null,null,null,null,"休業損失担保条項"]
[null,null,null,null,null,null,null,null,null,null,null,null,null,null,null,null,null,{"$f":"IFERROR(VLOOKUP($U$19,'保険料表（隠す）'!B:J,4,0),\"\")","v":""},null,null,null,null,null,"円",{"$f":"IFERROR(VLOOKUP($U$19,'保険料表（隠す）'!B:J,5,0),\"\")","v":""},null,null,null,null,null,"円"]
[]
[null,"※登録口座以外の振込先を希望される場合はご記入ください。"]
[null,"返戻保険料支払口座"]
[null,"金融機関名",null,null,null,null,null,null,null,null,null,"支店名"]
[]
[]
[null,null,null,null,null,null,null,null,null,null,null,null,null,null,null,null,null,null,null,null,null,null,null,"口座情報変更月"]
[null,"金融機関コード",null,null,null,null,null,null,null,null,null,"支店コード",null,null,null,null,null,null,null,null,null,null,null,"令和",null,null,null,"年",null,null,"月"]
[null,null,null,null,null,null,null,null,null,null,null,null,null,null,null,null,null,null,null,null,null,null,null,"口座情報停止月"]
[null,null,null,null,null,null,null,null,null,null,null,null,null,null,null,null,null,null,null,null,null,null,null,"令和",null,null,null,"年",null,null,"月"]
[]
[null,"預金種目",null,null,null,null,null,null,"口座番号",null,null,null,null,null,null,null,null,null,null,null,null,null,null,"窓口受付欄",null,null,null,"全共済受付印"]
[null,null,null,null,null,null,null,null,null,null,null,null,null,null,null,null,null,null,null,null,null,null,null,"日付・担当者"]
[null,"口座名義人（カナ）"]

{"sheet":"解約（12回払）","index":2,"n_rows":39,"n_cols":35,"rows_kept":39,"cut":false,"hidden":false,"merged":[[38,23,38,26],[3,19,3,20],[3,21,3,23],[3,24,3,30],[3,15,4,18],[32,23,32,30],[15,24,15,25],[28,1,29,15],[28,16,29,16],[28,17,28,23],[28,24,28,30],[29,17,29,22],[29,24,29,29],[14,4,15,5],[16,8,16,11],[26,1,26,30],[7,34,9,39],[19,17,22,19],[19,20,22,30],[14,24,14,25],[14,13,15,14],[16,12,16,14],[14,11,15,12],[19,4,22,13],[1,5,1,6],[1,8,1,9],[1,11,1,12],[15,20,15,21],[6,2,6,29],[14,6,15,6],[14,7,15,7],[14,8,15,9],[14,10,15,10],[8,16,8,18],[1,15,1,18],[1,19,1,25],[1,26,1,27],[1,28,1,30],[2,19,2,30],[2,15,2,18],[40,21,40,22],[10,1,10,30],[12,1,12,3],[12,4,12,26],[12,27,12,30],[14,1,15,3],[14,17,15,19],[14,20,14,21],[27,17,27,30],[38,19,38,20],[38,21,38,22],[40,19,40,20],[16,21,17,30],[37,27,37,30],[16,17,16,19],[16,1,16,7],[19,1,22,3],[27,1,27,16],[25,1,25,30],[24,1,24,30],[37,23,37,26],[33,28,33,29],[34,23,34,30],[35,23,35,24],[35,25,35,26],[35,28,35,29],[33,23,33,24],[33,25,33,26]]}
[]
[null,"請求日：令和",null,null,null,null,null,"年",null,null,"月",null,null,"日",null,"証券番号",null,null,null,{"$f":"IFERROR(VLOOKUP(Y15,'保険料表（隠す）'!A34:B45,2,0),\"\")","v":""},null,null,null,null,null,null,"枝番"]
[null,null,null,null,null,null,null,null,null,null,null,null,null,null,null,"窓口名",null,null,null,"顧客コード"]
[null,null,null,null,null,null,null,null,null,null,null,null,null,null,null,null,null,null,null,"窓口",null,"支部",null,null,"事業所"]
[null,null,null,null,null,null,null,null,null,null,null,null,null,null,null,null,null,null,null,{"$f":"IFERROR(VLOOKUP(P4,'保険料表（隠す）'!D34:F87,2,0),\"\")","v":""},{"$f":"IFERROR(VLOOKUP(P4,'保険料表（隠す）'!D34:F87,3,0),\"\")","v":""},null,null,null,0,0,0]
[]
[null,null,"日整連『キープtheモータース保険』解約依頼書"]
[null,null,null,null,null,null,null,null,null,null,null,null,null,null,null,null,null,null,null,null,null,null,null,null,null,null,null,null,null,null,null,null,null,null,"戻る"]
[null,"一般社団法人　日本自動車整備振興会連合会",null,null,null,null,null,null,null,null,null,null,null,null,null,null,"御中"]
[]
[null,"【重要】\n　下記のとおり、一般社団法人　日本自動車整備振興会連合会　「キープtheモータース保険」への解約を依頼します。\n　申込人（加入者）および被保険者は募集文書に掲載の個人情報の取扱いに同意します。"]
[null,"　"]
[null,"事業者名",null,null,null,null,null,null,null,null,null,null,null,null,null,null,null,null,null,null,null,null,null,null,null,null,null,"印"]
[]
[null,"解約日",null,null,"令和",null,null,"年",null,null,"月",1,null,"日",null,null,null,"契約\n保険期間",null,null,"令和",null,4,"年",null,null,"月",1,"日","から"]
[null,null,null,null,null,null,null,null,null,null,null,null,null,null,null,null,null,null,null,null,"令和",null,{"$f":"W15+1","v":5},"年",{"$f":"$Y$15","v":0},null,"月",1,"日","まで"]
[null,"未経過保険期間",null,null,null,null,null,null,{"$f":"返戻保険料計算!J23","v":""},null,null,null,"か月"]
[]
[null,null,null,null,null,null,null,null,null,null,null,null,null,null,null,null,null,"※契約時の売上高区分を選択ください。"]
[null,"契約時\n払込方法",null,null,"12回払",null,null,null,null,null,null,null,null,null,null,null,null,"契約時\n売上高\n区分"]
[]
[]
[]
[]
[null,"解約返戻金はございません。"]
[null,"解約日の翌々月より掛金請求が停止いたします。"]
[]
[null,"原契約保険料",null,null,null,null,null,null,null,null,null,null,null,null,null,null,null,"内訳保険料"]
[null,{"$f":"IFERROR(VLOOKUP($U$20,'保険料表（隠す）'!B:J,7,0),\"\")","v":""},null,null,null,null,null,null,null,null,null,null,null,null,null,null,"円","物損害担保条項",null,null,null,null,null,null,"休業損失担保条項"]
[null,null,null,null,null,null,null,null,null,null,null,null,null,null,null,null,null,{"$f":"IFERROR(VLOOKUP($U$20,'保険料表（隠す）'!B:J,8,0),\"\")","v":""},null,null,null,null,null,"円",{"$f":"IFERROR(VLOOKUP($U$20,'保険料表（隠す）'!B:J,9,0),\"\")","v":""},null,null,null,null,null,"円"]
[]
[]
[null,null,null,null,null,null,null,null,null,null,null,null,null,null,null,null,null,null,null,null,null,null,null,"口座情報変更月"]
[null,null,null,null,null,null,null,null,null,null,null,null,null,null,null,null,null,null,null,null,null,null,null,"令和",null,null,null,"年",null,null,"月"]
[null,null,null,null,null,null,null,null,null,null,null,null,null,null,null,null,null,null,null,null,null,null,null,"口座情報停止月"]
[null,null,null,null,null,null,null,null,null,null,null,null,null,null,null,null,null,null,null,null,null,null,null,"令和",null,null,null,"年",null,null,"月"]
[]
[null,null,null,null,null,null,null,null,null,null,null,null,null,null,null,null,null,null,null,null,null,null,null,"窓口受付欄",null,null,null,"全共済受付印"]
[null,null,null,null,null,null,null,null,null,null,null,null,null,null,null,null,null,null,null,null,null,null,null,"日付・担当者"]

{"sheet":"その他","index":3,"n_rows":45,"n_cols":35,"rows_kept":45,"cut":false,"hidden":false,"merged":[[29,17,29,30],[35,7,35,30],[10,1,10,30],[12,1,12,3],[12,4,12,26],[12,27,12,30],[14,13,15,14],[14,11,15,11],[14,8,15,9],[17,1,20,3],[22,14,22,16],[22,25,22,27],[22,17,22,19],[28,14,28,16],[22,8,22,9],[26,7,26,30],[28,7,28,13],[15,24,15,25],[14,4,15,5],[23,4,23,6],[24,4,25,6],[22,21,22,23],[22,1,29,3],[17,4,18,9],[14,17,15,19],[14,20,14,21],[15,20,15,21],[8,17,8,18],[14,1,15,3],[14,24,14,25],[7,34,8,39],[27,7,27,30],[28,17,28,30],[17,10,18,15],[17,16,18,21],[19,4,20,9],[19,10,20,15],[19,16,20,21],[17,22,18,30],[19,22,20,30],[22,4,22,6],[22,11,22,13],[23,7,23,30],[24,7,25,30],[8,15,8,16],[30,14,30,16],[30,17,30,19],[34,7,34,30],[35,4,35,6],[29,7,29,13],[29,14,29,16],[1,19,1,25],[1,26,1,27],[1,28,1,30],[3,19,3,20],[3,21,3,23],[3,24,3,30],[2,19,2,30],[14,6,15,6],[14,7,15,7],[14,10,15,10],[14,12,15,12],[1,15,1,18],[2,15,2,18],[3,15,4,18],[6,1,6,30],[1,5,1,6],[1,8,1,9],[1,11,1,12],[30,1,37,3],[26,4,26,6],[27,4,27,6],[28,4,28,6],[29,4,29,6],[31,4,31,6],[32,4,33,6],[34,4,34,6],[30,4,30,6],[30,11,30,13],[31,7,31,30],[32,7,33,30],[30,21,30,23],[30,25,30,27],[41,27,41,30],[42,27,44,30],[37,4,37,6],[37,14,37,16],[36,7,36,13],[37,7,37,13],[37,17,37,30],[36,4,36,6],[41,23,41,26],[42,23,42,26],[42,20,42,21],[44,20,44,21],[41,15,41,22],[43,15,43,22],[42,15,42,16],[44,15,44,16],[36,17,36,30],[36,14,36,16],[30,8,30,9]]}
[]
[null,"請求日：令和",null,null,null,null,null,"年",null,null,"月",null,null,"日",null,"証券番号",null,null,null,{"$f":"IFERROR(VLOOKUP(Y15,'保険料表（隠す）'!A34:B45,2,0),\"\")","v":""},null,null,null,null,null,null,"枝番"]
[null,null,null,null,null,null,null,null,null,null,null,null,null,null,null,"窓口名",null,null,null,"顧客コード"]
[null,null,null,null,null,null,null,null,null,null,null,null,null,null,null,null,null,null,null,"窓口",null,"支部",null,null,"事業所"]
[null,null,null,null,null,null,null,null,null,null,null,null,null,null,null,null,null,null,null,{"$f":"IFERROR(VLOOKUP(P4,'保険料表（隠す）'!D34:F87,2,0),\"\")","v":""},{"$f":"IFERROR(VLOOKUP(P4,'保険料表（隠す）'!D34:F87,3,0),\"\")","v":""},null,null,null,0,0,0]
[]
[null,"日整連『キープtheモータース保険』加入内容変更依頼書"]
[null,null,null,null,null,null,null,null,null,null,null,null,null,null,null,null,null,null,null,null,null,null,null,null,null,null,null,null,null,null,null,null,null,null,"戻る"]
[null,"一般社団法人　日本自動車整備振興会連合会",null,null,null,null,null,null,null,null,null,null,null,null,null,"御中"]
[]
[null,"【重要】\n　下記のとおり、一般社団法人　日本自動車整備振興会連合会　「キープtheモータース保険」への加入内容変更を依頼します。\n　申込人（加入者）および被保険者は募集文書に掲載の個人情報の取扱いに同意します。"]
[null," "]
[null,"事業者名",null,null,null,null,null,null,null,null,null,null,null,null,null,null,null,null,null,null,null,null,null,null,null,null,null,"印"]
[]
[null,"変更日",null,null,"令和",null,null,"年",null,null,"月",1,"日",null,null,null,null,"原契約\n保険期間",null,null,"令和",null,4,"年",null,null,"月",1,"日","から"]
[null,null,null,null,null,null,null,null,null,null,null,null,null,null,null,null,null,null,null,null,"令和",null,{"$f":"W15+1","v":5},"年",{"$f":"$Y$15","v":0},null,"月",1,"日","まで"]
[]
[null,"変更\n事由",null,null,"加入者情報変更",null,null,null,null,null,"口座振替変更",null,null,null,null,null,"加入証再発行",null,null,null,null,null,"その他変更内容"]
[]
[]
[]
[null,"※変更前と変更後の加入者情報をご入力ください。（変更箇所のみ）"]
[null,"変更前\n加入者\n情報",null,null,"郵便番号",null,null,"〒",null,null,"―",null,null,null,"電話番号",null,null,null,null,null,"ー",null,null,null,"ー"]
[null,null,null,null,"ﾌﾘｶﾞﾅ"]
[null,null,null,null,"(旧)\n住所"]
[]
[null,null,null,null,"ﾌﾘｶﾞﾅ"]
[null,null,null,null,"(旧)\n事業者名"]
[null,null,null,null,"ﾌﾘｶﾞﾅ",null,null,null,null,null,null,null,null,null,"ﾌﾘｶﾞﾅ"]
[null,null,null,null,"（旧）\n役職名",null,null,null,null,null,null,null,null,null,"(旧)\n代表者名"]
[null,"変更後\n加入者\n情報",null,null,"郵便番号",null,null,"〒",null,null,"―",null,null,null,"電話番号",null,null,null,null,null,"ー",null,null,null,"ー"]
[null,null,null,null,"ﾌﾘｶﾞﾅ"]
[null,null,null,null,"(新)\n住所"]
[]
[null,null,null,null,"ﾌﾘｶﾞﾅ"]
[null,null,null,null,"(新)\n事業者名"]
[null,null,null,null,"ﾌﾘｶﾞﾅ",null,null,null,null,null,null,null,null,null,"ﾌﾘｶﾞﾅ"]
[null,null,null,null,"（新）\n役職名",null,null,null,null,null,null,null,null,null,"(新)\n代表者名"]
[]
[]
[]
[null,null,null,null,null,null,null,null,null,null,null,null,null,null,null,"口座情報変更月",null,null,null,null,null,null,null,"窓口受付欄",null,null,null,"全共済受付印"]
[null,null,null,null,null,null,null,null,null,null,null,null,null,null,null,"令和",null,null,null,"年",null,null,"月","日付・担当者"]
[null,null,null,null,null,null,null,null,null,null,null,null,null,null,null,"口座情報停止月"]
[null,null,null,null,null,null,null,null,null,null,null,null,null,null,null,"令和",null,null,null,"年",null,null,"月"]

{"sheet":"保険料表（隠す）","index":4,"n_rows":87,"n_cols":10,"rows_kept":87,"cut":false,"hidden":true,"merged":[[32,4,32,5],[2,2,4,2],[4,3,4,5],[4,7,4,9],[2,0,3,0],[2,1,3,1],[2,8,3,8],[2,9,3,9],[2,3,3,3],[2,4,3,4],[2,5,3,5],[2,7,3,7],[2,6,4,6]]}
["キープtheモータース保険　保険料表"]
["機械設備等の補償＋休業損失の補償　支払限度額1000万円"]
["クラス","売上高区分","合計掛金\n（制度維持費200円含む)","合計保険料","物損害ユニット","休業ユニット","合計掛金\n（制度維持費200円含む)","合計保険料","物損害ユニット","休業ユニット"]
[]
[null,null,null,"一括払",null,null,null,"12回払"]
["A","A 1,000万円以下",42510,42310,9920,32390,3730,3530,830,2700]
["B","B 1,000万円超-2,000万円以下",50380,50180,14880,35300,4380,4180,1240,2940]
["C","C 2,000万円超-3,000万円以下",66110,65910,24800,41110,5700,5500,2070,3430]
["D","D 3,000万円超-4,000万円以下",81850,81650,34720,46930,7000,6800,2890,3910]
["E","E 4,000万円超-5,000万円以下",97590,97390,44640,52750,8320,8120,3720,4400]
["F","F 5,000万円超-6,000万円以下",112950,112750,54550,58200,9600,9400,4550,4850]
["G","G 6,000万円超-7,000万円以下",127950,127750,64470,63280,10840,10640,5370,5270]
["H","H 7,000万円超-8,000万円以下",142950,142750,74390,68360,12100,11900,6200,5700]
["I","I 8,000万円超-9,000万円以下",157950,157750,84310,73440,13350,13150,7030,6120]
["J","J 9,000万円超-10,000万円以下",172960,172760,94230,78530,14590,14390,7850,6540]
["K","K 10,000万円超-11,000万円以下",187960,187760,104150,83610,15850,15650,8680,6970]
["L","L 11,000万円超-12,000万円以下",202960,202760,114070,88690,17100,16900,9510,7390]
["M","M 12,000万円超-13,000万円以下",217960,217760,123990,93770,18340,18140,10330,7810]
["N","N 13,000万円超-14,000万円以下",232960,232760,133910,98850,19600,19400,11160,8240]
["O","O 14,000万円超-15,000万円以下",247970,247770,143830,103940,20850,20650,11990,8660]
["P","P 15,000万円超-16,000万円以下",262960,262760,153740,109020,22090,21890,12810,9080]
["Q","Q 16,000万円超-17,000万円以下",277960,277760,163660,114100,23350,23150,13640,9510]
["R","R 17,000万円超-18,000万円以下",292960,292760,173580,119180,24600,24400,14470,9930]
["S","S 18,000万円超-19,000万円以下",307960,307760,183500,124260,25850,25650,15290,10360]
["T","T 19,000万円超-20,000万円以下",322970,322770,193420,129350,27100,26900,16120,10780]
["U","U 20,000万円超-21,000万円以下",336620,336420,202590,133830,28230,28030,16880,11150]
["V","V 21,000万円超-22,000万円以下",348900,348700,211000,137700,29260,29060,17580,11480]
["W","W 22,000万円超-23,000万円以下",361200,361000,219420,141580,30280,30080,18280,11800]
["X","X 23,000万円超-24,000万円以下",373490,373290,227830,145460,31310,31110,18990,12120]
["Y","Y 24,000万円超-25,000万円以下",385780,385580,236240,149340,32330,32130,19690,12440]
["Z","Z 25,000万円超-26,000万円以下",398080,397880,244660,153220,33360,33160,20390,12770]
[]
[null,"証券番号",null,"窓口名","コード番号"]
[1,"9802787600",null,"札幌","０",2]
[2,"9802787601",null,"函館","０",3]
[3,"9802787602",null,"室蘭","０",4]
[4,"9802787603",null,"帯広","０",5]
[5,"9802787604",null,"釧路","０",6]
[6,"9802787605",null,"北見","０",7]
[7,"9802787606",null,"旭川","０",8]
[8,"9802787607",null,"宮城","０",9]
[9,"9802787608",null,"福島","１",0]
[10,"9802787609",null,"岩手","１",1]
[11,"9802787610",null,"青森","１",2]
[12,"9802787611",null,"新潟","１",3]
[null,null,null,"長野","１",4]
[null,null,null,"山形","１",5]
[null,null,null,"秋田","１",6]
[null,null,null,"東京","１",8]
[null,null,null,"神奈川","２",0]
[null,null,null,"埼玉","２",1]
[null,null,null,"群馬","２",2]
[null,null,null,"千葉","２",3]
[null,null,null,"茨城","２",4]
[null,null,null,"栃木","２",6]
[null,null,null,"山梨","２",7]
[null,null,null,"愛知","２",8]
[null,null,null,"静岡","３",0]
[null,null,null,"岐阜","３",2]
[null,null,null,"三重","３",4]
[null,null,null,"福井","３",5]
[null,null,null,"石川","３",6]
[null,null,null,"富山","３",8]
[null,null,null,"大阪","３",9]
[null,null,null,"京都","４",1]
[null,null,null,"兵庫","４",4]
[null,null,null,"奈良","４",5]
[null,null,null,"滋賀","４",7]
[null,null,null,"和歌山","４",8]
[null,null,null,"広島","５",0]
[null,null,null,"鳥取","５",1]
[null,null,null,"島根","５",2]
[null,null,null,"岡山","５",4]
[null,null,null,"山口","５",5]
[null,null,null,"香川","５",8]
[null,null,null,"徳島","５",9]
[null,null,null,"愛媛","６",0]
[null,null,null,"高知","６",1]
[null,null,null,"福岡","６",2]
[null,null,null,"長崎","６",4]
[null,null,null,"大分","６",5]
[null,null,null,"佐賀","６",6]
[null,null,null,"熊本","６",8]
[null,null,null,"宮﨑","６",9]
[null,null,null,"鹿児島","7",0]
[null,null,null,"沖縄","7",2]
[null,null,null,"日車協","8",8]

{"sheet":"返戻保険料計算","index":5,"n_rows":28,"n_cols":10,"rows_kept":28,"cut":false,"hidden":true,"merged":[[6,6,6,7],[27,6,27,7]]}
["令和","西暦読み替え","読み替え後保険始期年","読み替え後保険始期月",null,"読み替え後脱退年","読み替え後脱退月",null,"経過月数","未経過月数"]
[4,2022,{"$f":"VLOOKUP('解約 (一括払)'!W15,A2:B7,2,0)","v":2022},{"$f":"'解約 (一括払)'!Y15","v":0},{"$f":"C2&\"/\"&D2","v":"2022/0"},{"$f":"VLOOKUP('解約 (一括払)'!G15,A2:B7,2,0)","v":{"$error":"#N/A"}},{"$f":"'解約 (一括払)'!I15","v":0},{"$f":"F2&\"/\"&G2","v":{"$error":"#N/A"}},{"$f":"DATEDIF(E2,H2,\"M\")","v":{"$error":"#VALUE!"}},{"$f":"IFERROR(12-I2,\"\")","v":""}]
[5,2023]
[6,2024]
[7,2025]
[8,2026]
[9,2027]
[null,null,null,"令和","月"]
[null,"返還保険料","⇒四捨五入",4,1]
["機械設備",{"$f":"'解約 (一括払)'!R30*返戻保険料計算!$J$2/12","v":{"$error":"#VALUE!"}},{"$f":"IFERROR(ROUND(B10,-1),\"\")","v":""},4,2]
["休業損失",{"$f":"'解約 (一括払)'!Y30*返戻保険料計算!$J$2/12","v":{"$error":"#VALUE!"}},{"$f":"IFERROR(ROUND(B11,-1),\"\")","v":""},4,3]
[null,null,null,4,4]
[null,null,null,4,5]
[null,null,null,4,6]
[null,null,null,4,7]
[null,null,null,4,8]
[null,null,null,4,9]
[null,null,null,4,10]
[null,null,null,4,11]
[null,null,null,4,12]
[]
["令和","西暦読み替え","読み替え後保険始期年","読み替え後保険始期月",null,"読み替え後脱退年","読み替え後脱退月",null,"経過月数","未経過月数"]
[4,2022,{"$f":"VLOOKUP('解約（12回払）'!W15,A23:B28,2,0)","v":2022},{"$f":"'解約（12回払）'!Y15","v":0},{"$f":"C23&\"/\"&D23","v":"2022/0"},{"$f":"VLOOKUP('解約（12回払）'!G15,A23:B28,2,0)","v":{"$error":"#N/A"}},{"$f":"'解約（12回払）'!I15","v":0},{"$f":"F23&\"/\"&G23","v":{"$error":"#N/A"}},{"$f":"DATEDIF(E23,H23,\"M\")","v":{"$error":"#VALUE!"}},{"$f":"IFERROR(12-I23,\"\")","v":""}]
[5,2023]
[6,2024]
[7,2025]
[8,2026]
[9,2027]